Projects / libpcap++ / Comments

Comments for libpcap++

04 Nov 2011 21:34 zandegran


In file included from ../pcap++/Pcap.h:15:0,
from Dumper.cc:11:
../pcap++/DataLink.h:432:3: warning: 'typedef' was ignored in this declaration [enabled by default]
Dumper.cc: In member function 'void pcappp::Dumper::open(FILE*)':
Dumper.cc:61:55: error: 'pcap_dump_fopen' was not declared in this scope
Dumper.cc: In member function 'long int pcappp::Dumper::ftell() const':
Dumper.cc:81:40: error: 'pcap_dump_ftell' was not declared in this scope
make[2]: *** [libpcap___la-Dumper.lo] Error 1
make[2]: Leaving directory `/home/zandegran/Downloads/libpcap++-0.0.2/pcap++'
make[1]: *** [all] Error 2
make[1]: Leaving directory `/home/zandegran/Downloads/libpcap++-0.0.2/pcap++'
make: *** [all-recursive] Error 1

I'm stuck in this error while doing Make

20 Dec 2008 12:46 wlcrck

thanks
very useful

Screenshot

Project Spotlight

ReciJournal

An open, cross-platform journaling program.

Screenshot

Project Spotlight

Veusz

A scientific plotting package.