Projects / ID2

ID2

ID2 is a small utility which shows information about given users or groups in the system based on passwd and group structures.

Tags
Licenses

Recent releases

  •  26 Dec 1999 20:07

    Release Notes: First freshmeat release.

    Recent comments

    23 Aug 2004 11:46 killerhippy

    compile fails with gcc (GCC) 3.3.4 (Debian 1:3.3.4-6sarge1)
    I am no C programmer, but I assume that the c-source is outdated. Here is my log:

    ---cut-on---

    gcc -Wall -g -ggdb -c id2.c

    id2.c:454:8: fehlendes abschließendes Zeichen "

    id2.c: In Funktion »print_data_bsd«:

    id2.c:455: error: Fehler beim Parsen before "User"

    id2.c:455: error: stray '\' in program

    id2.c:455: error: stray '\' in program

    id2.c:456: error: stray '\' in program

    id2.c:457: error: stray '\' in program

    id2.c:457: error: stray '\' in program

    id2.c:458: error: stray '\' in program

    id2.c:458: error: stray '\' in program

    id2.c:459: error: stray '\' in program

    id2.c:460: error: stray '\' in program

    id2.c:461: error: stray '\' in program

    id2.c:462: error: stray '\' in program

    id2.c:462: error: stray '\' in program

    id2.c:463: error: stray '\' in program

    id2.c:463: error: stray '\' in program

    id2.c:464: error: stray '\' in program

    id2.c:464: error: stray '\' in program

    id2.c:464:27: fehlendes abschließendes Zeichen "

    id2.c:484:8: fehlendes abschließendes Zeichen "

    id2.c: In Funktion »print_data_linux«:

    id2.c:485: error: Fehler beim Parsen before "User"

    id2.c:485: error: stray '\' in program

    id2.c:485: error: stray '\' in program

    id2.c:486: error: stray '\' in program

    id2.c:487: error: stray '\' in program

    id2.c:487: error: stray '\' in program

    id2.c:488: error: stray '\' in program

    id2.c:488: error: stray '\' in program

    id2.c:489: error: stray '\' in program

    id2.c:490: error: stray '\' in program

    id2.c:490: error: stray '\' in program

    id2.c:491: error: stray '\' in program

    id2.c:491: error: stray '\' in program

    id2.c:491: error: stray '\' in program

    id2.c:491: error: stray '\' in program

    id2.c:491:26: fehlendes abschließendes Zeichen "

    id2.c:508:8: fehlendes abschließendes Zeichen "

    id2.c: In Funktion »shadow_print«:

    id2.c:509: error: Fehler beim Parsen before "Last"

    id2.c:509: error: stray '\' in program

    id2.c:509: error: stray '\' in program

    id2.c:510: error: stray '\' in program

    id2.c:511: error: stray '\' in program

    id2.c:512: error: stray '\' in program

    id2.c:513: error: stray '\' in program

    id2.c:514: error: stray '\' in program

    id2.c:514: error: stray '\' in program

    id2.c:514: error: stray '\' in program

    id2.c:514:36: fehlendes abschließendes Zeichen "

    id2.c:554:9: fehlendes abschließendes Zeichen "

    id2.c: In Funktion »help_info«:

    id2.c:555: error: Fehler beim Parsen before "This"

    id2.c:555: error: stray '\' in program

    id2.c:555: error: stray '\' in program

    id2.c:555:54: fehlendes abschließendes Zeichen "

    make: *** [id2.o] Fehler 1

    ---cut-off---

    Screenshot

    Project Spotlight

    OpenStack4j

    A Fluent OpenStack client API for Java.

    Screenshot

    Project Spotlight

    TurnKey TWiki Appliance

    A TWiki appliance that is easy to use and lightweight.